{"text_format":"1","workbook":"xlsx","n_sheets":38,"sheets":["Cover Sheet","Main Menu","Objectives","Model_Dashboard","Media_Method","Cases_Hosp","Media_counts","Calculations","Calculations_M","Results","Results_M","Charts","Charts_Export","Poster chart","Data Lists","Sensitivity Analysis_M","Call_volume-peak","Call_volume-peak_M","Data Lists_M","Data Source - Case Projections ","Data Source - Call-to-Hosp","Data Source - Media-to-Call","Data Source - Decline Rate","Data Source - Media activity","Data Source - Sx vs Info Calls","Glossary","Data Sources and References","Spaiulding","Cases_Hosp_M","Data Source - Case Projec_M ","Data Source - Call-to-Hosp_M","Data Source - Media-to-Call_M","Data Source - Media activity_M","Data Source - Decline Rate_M","Data Source - Sx vs Info Call_M","Spaiulding (2)","MN ILI Data","FluServe"],"not_rendered":{"charts":19,"images":56,"macros":1,"external_links":0,"defined_names":124,"comments":2,"pivot_tables":0},"unopened":[],"bounds":{"document_bytes":16777216,"sheet_cells":100000,"rows_first":2000,"rows_last":500,"rows_between":2000,"halvings":0,"cell_chars":16384,"cell_head_chars":4096},"cells_cut":0,"cells_raw":0,"read":"row_number_cap","date_system":"1900"}

{"sheet":"Cover Sheet","index":0,"n_rows":18,"n_cols":7,"rows_kept":18,"cut":false,"hidden":false,"merged":[[1,3,2,10],[17,4,17,8],[12,5,12,7],[11,5,11,7],[13,5,13,7],[14,4,14,8],[15,5,15,7],[16,5,16,7]]}
[]
[null,null,null,"Call Volume Projection Tool"]
[]
[]
[]
[]
{"$rows_left_out":13}
{"sheet":"Main Menu","index":1,"n_rows":20,"n_cols":13,"rows_kept":20,"cut":false,"hidden":false,"merged":[[1,3,2,16]]}
[]
[null,null,null,"Call Volume Projection Tool"]
[]
[]
[]
[]
{"$rows_left_out":15}
{"sheet":"Objectives","index":2,"n_rows":3,"n_cols":3,"rows_kept":3,"cut":false,"hidden":false,"merged":[[2,2,3,17]]}
[]
[]
[null,null,"Call Volume Projection Tool"]

{"sheet":"Model_Dashboard","index":3,"n_rows":78,"n_cols":6,"rows_kept":78,"cut":false,"hidden":false,"merged":[[54,12,55,15],[38,3,38,5],[34,1,34,2],[25,1,26,1]]}
[]
[]
[]
[]
[]
[]
{"$rows_left_out":73}
{"sheet":"Media_Method","index":4,"n_rows":112,"n_cols":11,"rows_kept":112,"cut":false,"hidden":true,"merged":[[28,5,28,7],[51,4,52,4],[51,7,52,7],[50,3,50,7],[51,6,52,6],[51,5,52,5],[4,2,4,7],[29,2,29,5],[26,3,26,5],[51,10,52,12],[76,10,76,14],[59,1,61,2],[51,8,52,8],[53,1,55,2],[51,9,52,9],[32,1,32,2],[34,3,34,5],[51,3,52,3],[8,1,8,2],[14,1,14,2],[16,1,16,2],[27,5,27,6]]}
[]
[]
[]
[]
[null,null,"(\"Media-to-call-rate\" Ratio Method)"]
[]
{"$rows_left_out":107}
{"sheet":"Cases_Hosp","index":5,"n_rows":60,"n_cols":33,"rows_kept":60,"cut":false,"hidden":false,"merged":[[0,1,2,5]]}
[null,"Influenza Cases,Hospitalization"]
[]
[]
[null,"Attack rate",{"$f":"IF(AttackRate=1,20,IF(AttackRate=2,30))","v":30}]
[null,"Seed",{"$f":"IF(Seed=1,10,IF(Seed=2,100))","v":10}]
[null,"Flu line opened ",{"$f":"WKOpenCallCenter","v":1},"week(s) after ",{"$f":" IF(CenterOpen = 1, \"START\", IF(CenterOpen = 2, \"PEAK\"))","v":"START"},"of pandemic"]
{"$rows_left_out":55}
{"sheet":"Media_counts","index":6,"n_rows":51,"n_cols":10,"rows_kept":51,"cut":false,"hidden":true,"merged":[[1,8,1,9],[1,4,1,5],[0,1,0,5]]}
[null,"Media counts projection",null,null,null,null,null,null,"Do not delete these data"]
[null,null,null,null,"Modeled Media Counts",null,null,null,"Media counts Distributions"]
[null,"Week (Pandemic starts)","Week when pandemic cases start to appear","Number of influenza cases (US)","Media stories (Low)","Media stories (High])",null,null,"Media stories                    (1st wave)","Media stories (2nd wave)"]
[null,1,{"$f":"IFERROR(IF(D4>0,1,\"\")+C3,IF(D4>0,1,\"\"))","v":1},{"$f":"IFERROR(IF(AND(AttackRate_m = 1, Seed = 1), 'Data Source - Case Projections '!D9, IF(AND(AttackRate_m = 1, Seed = 2), 'Data Source - Case Projections '!E9, IF(AND(AttackRate_m = 2,Seed = 1),'Data Source - Case Projections '!F9, 'Data Source - Case Projections '!G9))),\"\")","v":15},{"$f":"Media_Method!G54","v":860},{"$f":"E4*Media_Method!$H$28","v":1118},null,null,{"$f":"IFERROR((_xlfn.LOGNORM.DIST(C4,3.77,3.2,FALSE))*16631,\"\")","v":1035.8163117592314},{"$f":"IF(AND(C4>0,D4<>\"\"), RANDBETWEEN(655, 875), \"\")","v":823}]
[null,2,2,{"$f":"IFERROR(IF(AND(AttackRate_m = 1, Seed = 1), 'Data Source - Case Projections '!D10, IF(AND(AttackRate_m = 1, Seed = 2), 'Data Source - Case Projections '!E10, IF(AND(AttackRate_m = 2,Seed = 1),'Data Source - Case Projections '!F10, 'Data Source - Case Projections '!G10))),\"\")","v":25},{"$f":"Media_Method!G55","v":875},{"$f":"E5*Media_Method!$H$28","v":1137.5},null,null,652.96934504429237,874]
[null,3,3,{"$f":"IFERROR(IF(AND(AttackRate_m = 1, Seed = 1), 'Data Source - Case Projections '!D11, IF(AND(AttackRate_m = 1, Seed = 2), 'Data Source - Case Projections '!E11, IF(AND(AttackRate_m = 2,Seed = 1),'Data Source - Case Projections '!F11, 'Data Source - Case Projections '!G11))),\"\")","v":50},{"$f":"Media_Method!G56","v":773},{"$f":"E6*Media_Method!$H$28","v":1004.9000000000001},null,null,487.78235950936443,792]
{"$rows_left_out":46}
{"sheet":"Calculations","index":7,"n_rows":65,"n_cols":20,"rows_kept":65,"cut":false,"hidden":false,"merged":[[0,0,1,19],[11,16,11,17],[11,18,11,19],[11,6,11,7],[11,12,11,13],[11,10,11,11],[11,8,11,9],[11,14,11,15],[11,2,11,5],[10,2,10,5],[13,4,13,5],[11,0,11,1],[10,12,10,19],[13,12,13,13],[13,14,13,19],[13,2,13,3],[13,10,13,11]]}
["Estimated call volumes by week after  start  of pandemic"]
[]
[null,null,null,null,null,null,null,"Data Selected from Dash Board"]
[null,null,null,null,null,null,"Attack rate",{"$f":"IF(AttackRate=1,20,IF(AttackRate=2,30))","v":30},null,null,null,null,null,null,null,null,"Low ","High"]
[null,null,null,null,null,null,"Seed",{"$f":"IF(Seed=1,10,IF(Seed=2,100))","v":10},null,null,null,null,null,null,"Information only",null,{"$f":"PropNonSymSeekInfoLow","v":0.40200000000000002},{"$f":"PropNonSymSeekInfoHigh","v":0.40200000000000002}]
["Pandemic",null,null,null,null,null,"Flu line opened ",{"$f":"WKOpenCallCenter","v":1},"week(s) after ",{"$f":" IF(CenterOpen = 1, \"START\", IF(CenterOpen = 2, \"PEAK\"))","v":"START"},"of pandemic",null,null,null,"Symptomatic",null,{"$f":"PropSympCallsLow","v":0.374},{"$f":"PropSympCallsHigh","v":0.374}]
{"$rows_left_out":60}
{"sheet":"Calculations_M","index":8,"n_rows":62,"n_cols":18,"rows_kept":62,"cut":false,"hidden":true,"merged":[[0,0,1,18],[11,0,11,1],[12,6,12,7],[12,8,12,9],[12,10,12,11],[12,12,12,13],[11,2,11,7],[11,8,11,13],[12,2,12,3],[12,4,12,5]]}
[" Estimated call volumes by week after  start  of pandemic"]
[]
[null,null,null,null,null,null,null,"Data Selected from Dash Board"]
[null,null,null,null,null,null,"Attack rate",{"$f":"IF(AttackRate_m=1,20,IF(AttackRate_m=2,30))","v":20},null,null,null,null,null,null,null,null,"Low ","High"]
[null,null,null,null,null,null,"Seed",{"$f":"IF(Seed_m=1,10,IF(Seed_m=2,100))","v":10},null,null,null,null,null,null,"Information only",null,{"$f":"PropNonSymSeekInfoLow_m","v":0.2225},{"$f":"PropNonSymSeekInfoHigh_m","v":0.2225}]
["Pandemic",null,null,null,null,null,"Flu line opened ",{"$f":"WKOpenCallCenter_m","v":1},"week(s) after ",{"$f":" IF(CenterOpen_m = 1, \"START\", IF(CenterOpen_m = 2, \"PEAK\"))","v":"START"},"of pandemic",null,null,null,"Symptomatic",null,{"$f":"PropSympCallsLow_m","v":0.41389999999999999},{"$f":"PropSympCallsHigh_m","v":0.41389999999999999}]
{"$rows_left_out":57}
{"sheet":"Results","index":9,"n_rows":90,"n_cols":14,"rows_kept":90,"cut":false,"hidden":true,"merged":[[30,10,31,11],[44,2,44,3],[30,4,31,5],[30,1,31,3],[30,6,31,7],[30,8,31,9],[50,4,50,5],[1,0,1,1],[17,2,17,3],[17,4,17,5],[64,3,64,4],[64,5,64,6],[62,5,62,6],[52,3,52,4],[52,5,52,6],[63,3,63,4],[63,5,63,6],[52,0,53,1],[54,0,54,1],[62,3,62,4],[28,1,28,3],[44,4,44,11]]}
[]
[{"$f":"IF('Data Lists'!C40=4,\"1957-Like Pandemic\",IF('Data Lists'!C40=3,\"1968-Like Pandemic\",IF('Data Lists'!C40=2,\"2009-Like Pandemic\",\"Mild Pandemic \")))","v":"1957-Like Pandemic"}]
[]
[null,null,null,null,null,"Attack rate",{"$f":"IF(AttackRate=1,20,IF(AttackRate=2,30))","v":30},"%"]
[]
[null,null,null,null,null,"Seed",{"$f":"IF(Seed=1,10,IF(Seed=2,100))","v":10},"%"]
{"$rows_left_out":85}
{"sheet":"Results_M","index":10,"n_rows":100,"n_cols":14,"rows_kept":100,"cut":false,"hidden":true,"merged":[[28,1,28,3],[30,1,31,3],[30,4,31,5],[30,6,31,7],[30,8,31,9],[28,7,29,9],[52,0,52,1],[15,1,15,12],[66,3,66,4],[66,5,66,6],[67,3,67,4],[67,5,67,6],[55,0,56,1],[55,3,55,4],[55,5,55,6],[57,0,57,1],[65,3,65,4],[65,5,65,6],[18,6,18,7],[30,10,31,11],[44,2,44,3],[44,4,44,11],[58,0,58,1],[60,0,60,1],[62,0,62,1],[64,0,64,1],[65,0,65,1],[66,0,66,1],[67,0,67,1],[59,0,59,1],[61,0,61,1],[63,0,63,1]]}
[]
[]
[]
[null,null,null,null,null,"Attack rate",{"$f":"IF(AttackRate_m=1,20,IF(AttackRate_m=2,30))","v":20},"%"]
[]
[null,null,null,null,null,"Seed",{"$f":"IF(Seed_m=1,10,IF(Seed_m=2,100))","v":10},"%"]
{"$rows_left_out":95}
{"sheet":"Charts","index":11,"n_rows":100,"n_cols":11,"rows_kept":100,"cut":false,"hidden":false,"merged":[[2,0,2,4],[48,3,48,10],[0,2,0,5],[50,7,50,8],[49,7,49,10],[49,3,49,6],[50,3,50,4],[50,5,50,6]]}
[{"$f":"Model_Dashboard!E12","v":"1957-Like Pandemic"},null,"Estimated call volumes by week after  start  of pandemic"]
[]
[" Cross check: Attack rate and Call center opening week match for both methods."]
["Method","Attack Rate","Call Centre opening week after start of pandemic","Scenario"]
["Call to hospitalization ratio",{"$f":"IF(AttackRate=1,20%,30%)","v":0.3},{"$f":"WKOpenCallCenter","v":1},{"$f":"Model_Dashboard!E12","v":"1957-Like Pandemic"}]
["Media_Method",{"$f":"IF(AttackRate_m=1,20%,30%)","v":0.2},{"$f":"WKOpenCallCenter_m","v":1}]
{"$rows_left_out":95}
{"sheet":"Charts_Export","index":12,"n_rows":106,"n_cols":37,"rows_kept":106,"cut":false,"hidden":false,"merged":[[0,3,0,9],[2,0,2,4],[54,3,54,10],[55,3,55,6],[55,7,55,10],[9,1,9,5],[9,6,9,10],[56,3,56,4],[56,5,56,6],[56,7,56,8],[26,1,26,5],[26,6,26,10]]}
[{"$f":"Model_Dashboard!E12","v":"1957-Like Pandemic"},null,null,"Estimated call volumes by week after  start  of pandemic"]
[]
[" Cross check: Attack rate and Call center opening week match for both methods."]
["Method","Attack Rate","Call Centre opening week",null,null,null,null,null,null,null,null,null,null,null,null,null,null,null,null,null,null,null,null,null,null,null,null,null,null,null,null,null,null,null,null,null,"Labels:"]
["Hospital_Method",{"$f":"IF(AttackRate=1,20%,30%)","v":0.3},{"$f":"WKOpenCallCenter","v":1},null,null,null,null,null,null,null,null,null,null,null,null,null,null,null,null,null,null,null,null,null,null,null,null,null,null,null,null,null,null,null,null,null,"Media-to-call-rate Method, Low"]
["Media_Method",{"$f":"IF(AttackRate_m=1,20%,30%)","v":0.2},{"$f":"WKOpenCallCenter_m","v":1},null,null,null,null,null,null,null,null,null,null,null,null,null,null,null,null,null,null,null,null,null,null,null,null,null,null,null,null,null,null,null,null,null,"Media-to-call-rate method , High"]
{"$rows_left_out":101}
{"sheet":"Poster chart","index":13,"n_rows":82,"n_cols":13,"rows_kept":82,"cut":false,"hidden":false,"merged":[[32,4,32,7],[33,4,33,5],[33,6,33,7],[32,9,32,12],[33,9,33,10],[33,11,33,12]]}
[]
[]
[]
[]
[]
[]
{"$rows_left_out":77}
{"sheet":"Data Lists","index":14,"n_rows":116,"n_cols":6,"rows_kept":116,"cut":false,"hidden":false,"merged":[]}
[null,"Input Range","Cell Link"]
["When does call center open?","START ",1]
[null,"PEAK"]
[]
["Level of media activity (start))"]
["LOW",null,1]
{"$rows_left_out":111}
{"sheet":"Sensitivity Analysis_M","index":15,"n_rows":18,"n_cols":7,"rows_kept":18,"cut":false,"hidden":true,"merged":[[9,1,9,2],[9,3,9,4],[9,5,9,6],[1,1,1,6],[2,1,2,2],[2,3,2,4],[2,5,2,6],[8,1,8,6]]}
["Sensitivity Analysis"]
[null,"Peak-to-end- rate  Method and Media Activities Level"]
[null,"Moderate media activities",null,"Low media activities",null,"High media activities"]
[null,"Lower estimate","Upper estimate","Lower estimate","Upper estimate","Lower estimate","Upper estimate"]
["Calls first week",24879,44824,22843,41593,28950,51286]
["Calls at peak week",857824,3200756,779840,2909778,1013792,3782711]
{"$rows_left_out":13}
{"sheet":"Call_volume-peak","index":16,"n_rows":60,"n_cols":16,"rows_kept":60,"cut":false,"hidden":true,"merged":[[0,2,1,11],[2,4,2,9]]}
[null,null," Call volume When Call center opened at (week ) after Peak  of Pandemic"]
[]
[null,null,null,null,"(The estimates are only applicable if at Call_Center_Data Tab)"]
[]
[null,null,null,null,null,null,null,null,null,null,null,null,null,null,"Low ","High"]
["Peak  Week",{"$f":"PeakWk","v":14},null,null,null,null,null,null,null,null,null,null,"Information only",null,{"$f":"PropNonSymSeekInfoLow","v":0.40200000000000002},{"$f":"PropNonSymSeekInfoHigh","v":0.40200000000000002}]
{"$rows_left_out":55}
{"sheet":"Call_volume-peak_M","index":17,"n_rows":60,"n_cols":16,"rows_kept":60,"cut":false,"hidden":true,"merged":[[0,2,1,11],[2,4,2,9]]}
[null,null," Call volume When Call center opened at (week ) after Peak  of Pandemic"]
[]
[null,null,null,null,"(The estimates are only applicable if at Call_Center_Data Tab)"]
[]
[null,null,null,null,null,null,null,null,null,null,null,null,null,null,"Low ","High"]
["Peak  Week",{"$f":"PeakWk_m","v":23},null,null,null,null,null,null,null,null,null,null,"Information only",null,{"$f":"PropNonSymSeekInfoLow_m","v":0.2225},{"$f":"PropNonSymSeekInfoHigh_m","v":0.2225}]
{"$rows_left_out":55}
{"sheet":"Data Lists_M","index":18,"n_rows":116,"n_cols":6,"rows_kept":116,"cut":false,"hidden":true,"merged":[]}
[null,"Input Range","Cell Link"]
["When does call center open?","START ",1]
[null,"PEAK"]
[]
["Level of media activity (start))"]
["LOW",null,1]
{"$rows_left_out":111}
{"sheet":"Data Source - Case Projections ","index":19,"n_rows":56,"n_cols":16,"rows_kept":56,"cut":false,"hidden":false,"merged":[[4,3,4,4],[4,5,4,6]]}
[]
[]
[]
[]
[null,null,"Attack Rate",0.2,null,0.3,null,null,null,null,null,null,null,null,null,"Number of cases"]
[null,null,"Seed",10,100,10,100]
{"$rows_left_out":51}
{"sheet":"Data Source - Call-to-Hosp","index":20,"n_rows":46,"n_cols":10,"rows_kept":46,"cut":false,"hidden":false,"merged":[]}
[]
[]
[]
[]
[]
[null,1,"\"Week\" column represents the week number of the year [6]"]
{"$rows_left_out":41}
{"sheet":"Data Source - Media-to-Call","index":21,"n_rows":38,"n_cols":8,"rows_kept":38,"cut":false,"hidden":true,"merged":[]}
[]
[]
[]
[]
[]
[null,1," \"Week\" column represents the week number of the year during the 2009 flu pandemic [6]"]
{"$rows_left_out":33}
{"sheet":"Data Source - Decline Rate","index":22,"n_rows":52,"n_cols":11,"rows_kept":52,"cut":false,"hidden":false,"merged":[]}
[]
[]
[]
[null,1,"The \"week\" column represents the week number of the year during the 2009 influenza pandemic [5]"]
[null,2,"The \"sum of print/internet\" column represents the number of print/internet stories about flu in 2009[5]"]
[null,3,"The decline rate is calculated under the \"decline rate\" column - (the number of stories in the prior week - the number of stories in the current week)/(the number of stories in the prior week)"]
{"$rows_left_out":47}
{"sheet":"Data Source - Media activity","index":23,"n_rows":66,"n_cols":13,"rows_kept":66,"cut":false,"hidden":true,"merged":[]}
[]
[]
[]
[]
[null,"Week","Sum of Print/Internet","Sum of National TV","Sum of Local TV","H1N1 positive specimens reported to CDC","% Decline in Print/Internet Stories","% Decline in National TV stories","Ratio of cases and Media stories"]
[null,16,451,136,1370,14,null,null,{"$f":"C6/F6","v":32.214285714285715}]
{"$rows_left_out":61}
{"sheet":"Data Source - Sx vs Info Calls","index":24,"n_rows":51,"n_cols":9,"rows_kept":51,"cut":false,"hidden":false,"merged":[]}
[]
[]
[]
[]
[null,null,null,null,1,"\"Week\" column represents the week number of the year [6]"]
[null,null,null,null,2,"\"Hospitalizations\" column represents the  number of hospitalization per week [6 - 7]"]
{"$rows_left_out":46}
{"sheet":"Glossary","index":25,"n_rows":0,"n_cols":0,"rows_kept":0,"cut":false,"hidden":false,"merged":[],"read":"row_number_cap"}

{"sheet":"Data Sources and References","index":26,"n_rows":80,"n_cols":3,"rows_kept":80,"cut":false,"hidden":false,"merged":[]}
[]
[]
[]
[]
[]
[]
{"$rows_left_out":75}
{"sheet":"Spaiulding","index":27,"n_rows":27,"n_cols":16,"rows_kept":27,"cut":false,"hidden":false,"merged":[]}
[]
[]
[null,null,"Total calls","Premature","Info only1"," ILI or Exposed","info/non-flu","Healh partner","Began protocal",null,"Info Only ","Uniqe call","Not complete protocal",null,null,"Complete protocal"]
[null,null,27391,6094,7339,13958,3691,3799,6488,null,308,6160,211,null,null,5949]
[null,null,null,{"$f":"D4/$C$4","v":0.22248183709977729},{"$f":"E4/$C$4","v":0.26793472308422472},0.50958343981599796,0.13475229089847029,0.13869519185133802,0.23686612390931328,null,1.1244569384104269E-2,0.22489138768208536,7.7032601949545473E-3,null,null,0.21718812748713082]
[]
{"$rows_left_out":22}
{"sheet":"Cases_Hosp_M","index":28,"n_rows":61,"n_cols":36,"rows_kept":61,"cut":false,"hidden":true,"merged":[[0,2,2,5]]}
[null,null,"Influenza Cases, Media Activities and Hospitalization"]
[]
[]
[null,"Attack rate",{"$f":"IF(AttackRate_m=1,20,IF(AttackRate_m=2,30))","v":20}]
[null,"Seed",{"$f":"IF(Seed_m=1,10,IF(Seed_m=2,100))","v":10}]
[null,"Flu line opened ",{"$f":"WKOpenCallCenter_m","v":1},"week(s) after ",{"$f":" IF(CenterOpen_m = 1, \"START\", IF(CenterOpen_m = 2, \"PEAK\"))","v":"START"},"of pandemic"]
{"$rows_left_out":56}
{"sheet":"Data Source - Case Projec_M ","index":29,"n_rows":58,"n_cols":13,"rows_kept":58,"cut":false,"hidden":true,"merged":[[4,3,4,4],[4,5,4,6]]}
[]
[]
[]
[]
[null,null,"Attack Rate",0.2,null,0.3]
[null,null,"Seed",10,100,10,100]
{"$rows_left_out":53}
{"sheet":"Data Source - Call-to-Hosp_M","index":30,"n_rows":46,"n_cols":10,"rows_kept":46,"cut":false,"hidden":true,"merged":[]}
[]
[]
[]
[]
[]
[null,1,"\"Week\" column represents the week number of the year [6]"]
{"$rows_left_out":41}
{"sheet":"Data Source - Media-to-Call_M","index":31,"n_rows":38,"n_cols":8,"rows_kept":38,"cut":false,"hidden":true,"merged":[]}
[]
[]
[]
[]
[]
[null,1," \"Week\" column represents the week number of the year during the 2009 flu pandemic [6]"]
{"$rows_left_out":33}
{"sheet":"Data Source - Media activity_M","index":32,"n_rows":66,"n_cols":13,"rows_kept":66,"cut":false,"hidden":true,"merged":[]}
[]
[]
[]
[]
[null,"Week","Sum of Print/Internet","Sum of National TV","Sum of Local TV","H1N1 positive specimens reported to CDC","% Decline in Print/Internet Stories","% Decline in National TV stories"]
[null,16,451,136,1370,14]
{"$rows_left_out":61}
{"sheet":"Data Source - Decline Rate_M","index":33,"n_rows":54,"n_cols":11,"rows_kept":54,"cut":false,"hidden":true,"merged":[]}
[]
[]
[]
[null,1,"The \"week\" column represents the week number of the year during the 2009 influenza pandemic [5]"]
[null,2,"The \"sum of print/internet\" column represents the number of print/internet stories about flu in 2009[5]"]
[null,3,"The decline rate is calculated under the \"decline rate\" column - (the number of stories in the prior week - the number of stories in the current week)/(the number of stories in the prior week)"]
{"$rows_left_out":49}
{"sheet":"Data Source - Sx vs Info Call_M","index":34,"n_rows":51,"n_cols":9,"rows_kept":51,"cut":false,"hidden":true,"merged":[]}
[]
[]
[]
[]
[null,null,null,null,1,"\"Week\" column represents the week number of the year [6]"]
[null,null,null,null,2,"\"Hospitalizations\" column represents the  number of hospitalization per week [6 - 7]"]
{"$rows_left_out":46}
{"sheet":"Spaiulding (2)","index":35,"n_rows":27,"n_cols":16,"rows_kept":27,"cut":false,"hidden":true,"merged":[]}
[]
[]
[null,null,"Total calls","Premature","Info only1"," ILI or Exposed","info/non-flu","Healh partner","Began protocal",null,"Info Only ","Uniqe call","Not complete protocal",null,null,"Complete protocal"]
[null,null,27391,6094,7339,13958,3691,3799,6488,null,308,6160,211,null,null,5949]
[null,null,null,{"$f":"D4/$C$4","v":0.22248183709977729},{"$f":"E4/$C$4","v":0.26793472308422472},0.50958343981599796,0.13475229089847029,0.13869519185133802,0.23686612390931328,null,1.1244569384104269E-2,0.22489138768208536,7.7032601949545473E-3,null,null,0.21718812748713082]
[]
{"$rows_left_out":22}
{"sheet":"MN ILI Data","index":36,"n_rows":54,"n_cols":7,"rows_kept":54,"cut":false,"hidden":true,"merged":[[22,6,30,15]]}
["Week","07-08 Season","08-09 Season","09-10 Season"]
[35,null,null,1.37]
[36,null,null,2.92]
[37,null,null,2.12]
[38,null,null,3.02]
[39,null,null,5.2]
{"$rows_left_out":49}
{"sheet":"FluServe","index":37,"n_rows":54,"n_cols":9,"rows_kept":54,"cut":false,"hidden":true,"merged":[]}
["Influenza Hospitalization Rates (per 100,000 population) are for the FluSurv-NET Network (downloaded on Sep-20-2013)"]
["Influenza Division - Centers for Disease Control and Prevention."]
["CATCHMENT","NETWORK","SEASON","MMWR-YEAR","MMWR-WEEK","AGE CATEGORY","RATE ","Number of Hospitalizations","Number of Hospitalizations from Tool"]
["Entire Network","FluSurv-NET","2009-10",2009,35,"Overall",0.3,{"$f":"G4*3000","v":900},74658.375000000015]
["Entire Network","FluSurv-NET","2009-10",2009,36,"Overall",1.2,{"$f":"G5*3000","v":3600},69585.450000000012]
["Entire Network","FluSurv-NET","2009-10",2009,37,"Overall",2,6000,44434.500000000007]
{"$rows_left_out":48}