{"text_format":"1","workbook":"xlsx","n_sheets":8,"sheets":["Title","Assumptions","Epi-demographic","Cost_dog_vax_aid","Default_data","Cost_dog_vax_example","Flowchart","Calculations"],"not_rendered":{"charts":3,"images":1,"macros":1,"external_links":0,"defined_names":1,"comments":0,"pivot_tables":0},"unopened":[],"bounds":{"document_bytes":16777216,"sheet_cells":100000,"rows_first":2000,"rows_last":500,"rows_between":2000,"halvings":0,"cell_chars":16384,"cell_head_chars":4096},"cells_cut":0,"cells_raw":0,"read":"whole","date_system":"1900"}

{"sheet":"Title","index":0,"n_rows":18,"n_cols":2,"rows_kept":18,"cut":false,"hidden":false,"merged":[[12,1,12,3]]}
[null,"Technical Appendix. Article link: https://wwwnc.cdc.gov/EID/article/23/12/17-1148-htm"]
[]
[]
[]
[]
[null,"Planning aid for the control of dog-mediated human rabies deaths based on dog vaccination*"]
[null,"Tool based on the article by Wallace et al. 2017  Front. Vet. Sci. 4:9. doi: 10.3389/fvets.2017.00009‡"]
[null,"Government perspective"]
[]
[null,{"$f":"Assumptions!D4","v":"2017-09-04"}]
[]
[]
[null,"Authors:†                       Ryan M. Wallace, Eduardo A. Undurraga, Jesse D. Blanton, M. Meltzer"]
[]
[]
{"$rows_left_out":4}
{"sheet":"Assumptions","index":1,"n_rows":38,"n_cols":5,"rows_kept":38,"cut":false,"hidden":false,"merged":[]}
[null,null,{"$f":"Title!B6","v":"Planning aid for the control of dog-mediated human rabies deaths based on dog vaccination*"}]
[null,null,{"$f":"Title!B7","v":"Tool based on the article by Wallace et al. 2017  Front. Vet. Sci. 4:9. doi: 10.3389/fvets.2017.00009‡"}]
[]
[null,null,"Updated:","2017-09-04"]
[null,null,"Study perspective:","Government "]
[]
[null,null,"Note:","The default values correspond to country estimates in Wallace et al. 2017"]
[]
[null,null,"Instructions:",null,"Blue tabs indicate sheets were program data are required"]
[]
[null,null,null,null,"White cell: user can modify content"]
[null,null,null,null,"Grey cell: do not modify content"]
[null,null,"Main assumptions"]
[null,1,"70% of the dog population has to be vaccinated annually for 5-7 years to eliminate dog rabies, as per WHO recommendations and some evidence (WHO 2013, Coleman et al. 1996, Cleaveland et la. 2003). There may be some variation by setting that we are not considering (Kitala et al. 2001)"]
[null,{"$f":"B14+1","v":2},"Dog vaccination coverage estimates by Hampson et al. 2015, are reasonably accurate."]
{"$rows_left_out":24}
{"sheet":"Epi-demographic","index":2,"n_rows":47,"n_cols":8,"rows_kept":47,"cut":false,"hidden":false,"merged":[[6,2,6,3]]}
[]
[null,"Demographic, epidemiological, and cost input variables",null,null,null,null,"Summary of results from the analysis: dog vaccination campaign"]
[null,"Model Variable","Input values","Default values"]
[]
[null,"Select country","Kenya",{"$f":"VLOOKUP(C5,Default_data!$A$2:$M$194, 2, FALSE)","v":"KEN"},null,null,"Resources needed (annual)"]
[null,null,null,null,null,null,"Total dog population",{"$f":"C16","v":5169798.054716981}]
[null,"Discount rate (health outcomes & costs)",0,null,null,null,"Dogs vaccinated",{"$f":"H6*C20","v":258489.90273584906}]
[null,null,null,null,null,null,"Dogs unvaccinated",{"$f":"H6-H7","v":4911308.1519811321}]
[null,"Demographics",null,null,null,null,"Number of additional vaccinated dogs required",{"$f":"H6*C21-H7","v":3360368.7355660377}]
[null,"Human population",46050302,{"$f":"VLOOKUP(D5,Default_data!$B$2:$M$194, 2, FALSE)","v":46050302},null,null,"Average cost per dog vaccinated",{"$f":"Cost_dog_vax_aid!J5","v":1.8080000000000001}]
[null,"Percent urban",0.26,{"$f":"VLOOKUP(D5,Default_data!$B$2:$M$194, 3, FALSE)","v":0.25622},null,null,"Estimated years until elimination",{"$f":"IF(C20<(0.25*Flowchart!H20),Flowchart!H21+6,IF(C20<0.5*Flowchart!H20,Flowchart!H21+3,IF(C20<0.75*Flowchart!H20,Flowchart!H21+2,IF(C20<Flowchart!H20,Flowchart!H21+1,7))))","v":13}]
[null,"Urban population",{"$f":"C10*C11","v":11973078.52},{"$f":"D10*D11","v":11799008.37844},null,null,"Vaccinators needed during peak campaign years",{"$f":"C32","v":1723.2660182389936}]
[null,"Rural population",{"$f":"C10-C12","v":34077223.480000004},{"$f":"D10-D12","v":34251293.62156},null,null,"Total costs to eliminate"]
[null,"Number of humans per dog, urban areas",21.2,{"$f":"VLOOKUP(D5,Default_data!$B$2:$M$194, 4, FALSE)","v":21.2},null,null,"Net present value (NPV) Phase I",{"$f":"IF(C20<Flowchart!F16, SUM(Calculations!C7:E7)*'Epi-demographic'!H7+'Epi-demographic'!H9*SUM(Calculations!C7:E7)*Calculations!C23, 0)","v":3224713.2346102642}]
[null,"Number of humans per dog, rural areas",7.4,{"$f":"VLOOKUP(D5,Default_data!$B$2:$M$194, 5, FALSE)","v":7.4},null,null,"Net present value Phase II",{"$f":"IF(C21=0,0,IF(C20<Flowchart!F16,Flowchart!H16*Calculations!F7*'Epi-demographic'!H6+Calculations!C23*Calculations!F7*('Epi-demographic'!C21-Flowchart!H16)*'Epi-demographic'!H6+Calculations!G7*Flowchart!H17*'Epi-demographic'!H6+Calculations!C23*('Epi-demographic'!C21-Flowchart!H17)*Calculations!G7*'Epi-demographic'!H6+Calculations!H7*Flowchart!H18*'Epi-demographic'!H6+Calculations!C23*Calculations!H7*('Epi-demographic'!C21-Flowchart!H18)*'Epi-demographic'!H6, IF('Epi-demographic'!C20>='Epi-demographic'!C21,0,IF('Epi-demographic'!C20<'Epi-demographic'!C21,IF('Epi-demographic'!C20>=Flowchart!F18, 'Epi-demographic'!C20*Calculations!C7*'Epi-demographic'!H6+Calculations!C23*('Epi-demographic'!C21-'Epi-demographic'!C20)*Calculations!C7*'Epi-demographic'!H6, IF('Epi-demographic'!C20>=Flowchart!F17,'Epi-demographic'!C20*Calculations!C7*'Epi-demographic'!H6+Calculations!C23*('Epi-demographic'!C21-'Epi-demographic'!C20)*'Epi-demographic'!H6*Calculations!C7+Calculations!D7*Flowchart!H18*'Epi-demographic'!H6+Calculations!C23*Calculations!D7*('Epi-demographic'!C21-Flowchart!H18)*'Epi-demographic'!H6, IF('Epi-demographic'!C20>=Flowchart!F16, Calculations!C7*'Epi-demographic'!C20*'Epi-demographic'!H6+Calculations!C23*Calculations!C7*('Epi-demographic'!C21-'Epi-demographic'!C20)*'Epi-demographic'!H6+Calculations!D7*Flowchart!H17*'Epi-demographic'!H6+Calculations!C23*Calculations!D7*('Epi-demographic'!C21-Flowchart!H17)*'Epi-demographic'!H6+Calculations!E7*Flowchart!H18*'Epi-demographic'!H6+Calculations!C23*Calculations!E7*('Epi-demographic'!C21-Flowchart!H18)*'Epi-demographic'!H6, \"error\")))))))","v":13004006.630873999}]
{"$rows_left_out":33}
{"sheet":"Cost_dog_vax_aid","index":3,"n_rows":114,"n_cols":11,"rows_kept":114,"cut":false,"hidden":false,"merged":[]}
[]
[null,"Costs per dog vaccination campaign",null,null,null,null,null,null,null,"Total"]
[null,"Summary of dog vaccination costs (per dog vaccinated)",null,null,null,null,null,null,"Lower bound ","Average","Upper bound"]
[]
[null,"Cost per dog vaccinated (user input; these values determine all cost estimates)*",null,null,null,null,null,null,1.4753333333333334,1.8080000000000001,2.1206666666666671]
[]
[]
[null,"Instructions:",null,null,null,"Examples of cost estimates of cost per dog vaccinated from previous studies"]
[null,"Enter your best estimate, including lower and upper bounds, ",null,null,null,"Location",null,null,null,"Author","Estimate (US$)"]
[null,"of the average cost to vaccinate a dog in the white cells in this panel.",null,null,null,"N'Djamena, Chad",null,null,null,"Kayali et al 2006",2.38]
[null,"These estimates will inform all the cost calculations in GDREP.",null,null,null,"Rural Tanzania (pastoralist and agro-pastolarist villages)",null,null,null,"Kaare et al 2009",2.39]
[null,"If you need help to estimate these values, use the tables",null,null,null,"Petchabun, Thailand",null,null,null,"Knobel et al 2005",1.6]
[null,"below with data from a dog vaccination campaign. ",null,null,null,"Dar es Salaam, Tanzania",null,null,null,"Hatch et al 2016",8.67]
[null,"There are a few estimates of the costs to vaccinate a dog",null,null,null,"Bohol, Visayas Islands, Philippines",null,null,null,"Lapiz et al 2012",1.76]
[null,"in the table at the right of the panel.",null,null,null,"Bhutan",null,null,null,"Tenzin et al 2012",1.93]
{"$rows_left_out":100}
{"sheet":"Default_data","index":4,"n_rows":200,"n_cols":13,"rows_kept":200,"cut":false,"hidden":true,"merged":[]}
["Country","ISO3","WB Human Pop 2015","WB Urban (%)","Urban H:D Ratio (Knoble)","Rural H:D Ration (Knoble)","Vax_coverage (Hampson)","Public Vet PubHealth Activities","Private Vet PubHealth Activities","PARA: Pub Hlth","All_PH_vacccinators","Paravet_PH","Years to elimination - best case scenario"]
["Afghanistan","AFG",32526562,0.26702999999999999,7.5,14.3,0.01,48,0,48,{"$f":"H2+I2+J2","v":96},{"$f":"J2","v":48},13]
["Albania","ALB",2889167,0.57406999999999997,6.5,6.5,0.46700000000000003,2.5994574079615962,0.42614055868222889,36.200640460055347,39.226238426699169,36.200640460055347,9]
["Algeria","DZA",39666519,0.70727000000000007,21.2,7.4,0.23699999999999999,1321,0,35,1356,35,10]
["Andorra","AND",70473,0.85114999999999996,6.5,6.5,0.7,5,0,10,15,10,7]
["Angola","AGO",25021974,0.44049999999999995,21.2,7.4,5.0000000000000001E-3,0,0,0,0,0,13]
["Antigua and Barbuda","ATG",91818,0.23773,7.5,7.5,0.55100000000000005,1.961157996167803,2.7896984298261783E-3,0.80343314778993924,2.7673808423875683,0.80343314778993924,8]
["Argentina","ARG",43416755,0.91751000000000005,7.5,7.5,0.20659920300000001,467,215,1151,1833,1151,10]
["Armenia","ARM",3017712,0.62673000000000001,6.5,6.5,0.46700000000000003,613,0,0,613,0,9]
["Australia","AUS",23781169,0.89422999999999997,7.5,14.3,0.7,190,25,886,1101,886,7]
["Austria","AUT",8611088,0.65968000000000004,6.5,6.5,0.7,214,0,0,214,0,7]
["Azerbaijan","AZE",9651349,0.54620000000000002,6.5,6.5,0.21099999999999999,4,0,0,4,0,10]
["Bahamas","BHS",388019,0.82873999999999992,7.5,7.5,0.55100000000000005,8.2877710744629027,1.1789148043332722E-2,3.3952746364798236,11.694834858986059,3.3952746364798236,8]
["Bahrain","BHR",1377237,0.88775000000000004,7.5,14.3,0.185,2,1,31,34,31,10]
["Bangladesh","BGD",160995642,0.34277000000000002,7.5,14.3,5.0849999999999999E-2,49.47195294540218,0,478.22887847222103,527.70083141762325,478.22887847222103,13]
{"$rows_left_out":186}
{"sheet":"Cost_dog_vax_example","index":5,"n_rows":102,"n_cols":11,"rows_kept":102,"cut":false,"hidden":false,"merged":[]}
[]
[null,"Worked example for costing a vaccination campaign. The numbers used largely correspond to publish literature, but do not represent any specific country. "]
[]
[null,"Costs per dog vaccination campaign",null,null,null,null,null,null,null,"Total"]
[null,"Summary of dog vaccination costs (per dog vaccinated)",null,null,null,null,null,null,"Lower bound ","Average","Upper bound"]
[]
[null,"Cost per dog vaccinated (user input; these values determine all cost estimates)*",null,null,null,null,null,null,1.63,2.17,2.63]
[]
[null,"Costs per dog vaccination campaign - user tables",null,null,null,null,null,null,null,"Total"]
[null,"Summary of dog vaccination costs based on calculation tables (per dog vaccinated)",null,null,null,null,null,null,"Lower bound ","Average","Upper bound"]
[]
[null,"Total dogs vaccinated in pilot campaign (user input)",null,null,null,null,null,null,null,999699.58666666655]
[]
[null,"Average cost per dog vaccinated (calculated using worksheet)",null,null,null,null,null,null,{"$f":"I92","v":1.6272929120213435},{"$f":"J92","v":2.1685702785579495},{"$f":"K92","v":2.6263874185590343}]
[]
{"$rows_left_out":88}
{"sheet":"Flowchart","index":6,"n_rows":24,"n_cols":15,"rows_kept":24,"cut":false,"hidden":false,"merged":[[9,2,10,4],[9,5,10,7],[9,8,10,14],[12,1,12,14],[2,2,2,4],[2,5,2,7],[2,8,2,14],[4,2,4,4],[4,8,4,14],[5,1,8,1]]}
[]
[null,"Figure 1. Global Dog Rabies Elimination Pathway (GDREP): Phases for a dog rabies elimination program based on 70% dog population vaccination coverage."]
[null,"Implementation Phase:","Phase I: Preparation",null,null,"Phase II: Scale-up dog vaccination",null,null,"Phase III: Sustained 70% dog vaccination"]
[null,"Program year",1,{"$f":"C4+1","v":2},{"$f":"D4+1","v":3},4,5,6,7,8,9,10,11,12,13]
[null,"Expected dog vax coverage:","<18%",null,null,{"$f":"CONCATENATE(TEXT(F16,\"#,##0%\"),\" - \", TEXT(G16,\"#,##0%\"))","v":"18% - 35%"},{"$f":"CONCATENATE(TEXT(F17,\"#,##0%\"),\" - \", TEXT(G17,\"#,##0%\"))","v":"35% - 53%"},{"$f":"CONCATENATE(TEXT(F18,\"#,##0%\"),\" - \", TEXT(G18,\"#,##0%\"))","v":"53% - 70%"},">70%"]
[null,"Activities acheived:","Field studies",null,null,"Pilot implementation",null,null,"Mass vaccination of dogs"]
[null,null,"Workforce training",null,null,"Scaling-up vaccination coverage",null,null,"Surveillance to establish disease freedom"]
[null,null,"Strengthening lab capacity",null,null,"Logistical improvements"]
[null,null,null,null,null,"Operational equipment"]
[null,"Cost estimates:","    Current Vaccination Coverage \n+ Infrastructure Improvements*",null,null,"         Expected Vaccination Coverage\n+ Infrastructure Improvements*",null,null,"Vaccination of 70% of the dog population"]
[]
[]
[null,"Notes: There is variation between and within countries for the implementation and scaling-up of national dog vaccination campaigns. Based on expert opinion from dog vaccine implementation strategies in Haiti, Ethiopia, United States, Vietnam, and Latin America, we assumed that the current dog rabies vaccination coverage was directly correlated to the number of years it will take to achieve elimination, as illustrated by the three distinct Phases shown in the figure. For countries in Phase II, we estimated dog vaccination as the median value in the corresponding year range (e.g., we used 26% vaccination coverage in the rage 18-35%), or the current country vaccination rate for those countries that were already vaccinating dogs at a rate equivalent to Phase II. *Infrastructural improvement costs were estimated to be equivalent to the cost of vaccination for 10% of the country’s unvaccinated dog population."]
[]
[null,null,null,null,"Phase II","Lower bound","Upper bound","Median"]
{"$rows_left_out":10}
{"sheet":"Calculations","index":7,"n_rows":61,"n_cols":17,"rows_kept":61,"cut":false,"hidden":false,"merged":[]}
[]
[null,"Internal calculations"]
[null,"Please do not modify the values in this worksheet"]
[]
[null,"Mean estimates","Years "]
[null,"Discounted values",0,1,2,3,4,5,6,7,8,9,10,11,12,"Total"]
[null,"Dog vaccines",{"$f":"Cost_dog_vax_aid!J5/(1+Calculations!$C$22)^Calculations!C6","v":1.8080000000000001},{"$f":"$C$7/(1+Calculations!$C$22)^Calculations!D6","v":1.8080000000000001},{"$f":"$C$7/(1+Calculations!$C$22)^Calculations!E6","v":1.8080000000000001},{"$f":"$C$7/(1+Calculations!$C$22)^Calculations!F6","v":1.8080000000000001},{"$f":"$C$7/(1+Calculations!$C$22)^Calculations!G6","v":1.8080000000000001},{"$f":"$C$7/(1+Calculations!$C$22)^Calculations!H6","v":1.8080000000000001},{"$f":"$C$7/(1+Calculations!$C$22)^Calculations!I6","v":1.8080000000000001},{"$f":"$C$7/(1+Calculations!$C$22)^Calculations!J6","v":1.8080000000000001},{"$f":"$C$7/(1+Calculations!$C$22)^Calculations!K6","v":1.8080000000000001},{"$f":"$C$7/(1+Calculations!$C$22)^Calculations!L6","v":1.8080000000000001},{"$f":"$C$7/(1+Calculations!$C$22)^Calculations!M6","v":1.8080000000000001},{"$f":"$C$7/(1+Calculations!$C$22)^Calculations!N6","v":1.8080000000000001},{"$f":"$C$7/(1+Calculations!$C$22)^Calculations!O6","v":1.8080000000000001}]
[null,"Dog vaccinations to reach goal",{"$f":"'Epi-demographic'!$C$16*Calculations!$C$24","v":3618858.6383018866},{"$f":"'Epi-demographic'!$C$16*Calculations!$C$24","v":3618858.6383018866},{"$f":"'Epi-demographic'!$C$16*Calculations!$C$24","v":3618858.6383018866},{"$f":"'Epi-demographic'!$C$16*Calculations!$C$24","v":3618858.6383018866},{"$f":"'Epi-demographic'!$C$16*Calculations!$C$24","v":3618858.6383018866},{"$f":"'Epi-demographic'!$C$16*Calculations!$C$24","v":3618858.6383018866},{"$f":"'Epi-demographic'!$C$16*Calculations!$C$24","v":3618858.6383018866},{"$f":"'Epi-demographic'!$C$16*Calculations!$C$24","v":3618858.6383018866},{"$f":"'Epi-demographic'!$C$16*Calculations!$C$24","v":3618858.6383018866},{"$f":"'Epi-demographic'!$C$16*Calculations!$C$24","v":3618858.6383018866},{"$f":"'Epi-demographic'!$C$16*Calculations!$C$24","v":3618858.6383018866},{"$f":"'Epi-demographic'!$C$16*Calculations!$C$24","v":3618858.6383018866},{"$f":"'Epi-demographic'!$C$16*Calculations!$C$24","v":3618858.6383018866}]
[null,"Dog vaccinations required",{"$f":"IF($C$25<$C$33,$C$25*$C$26,IF($C$25>=$C$24,$C$24*$C$26,IF($C$25>=$C$35,$C$26*$C$25,IF($C$25>=$C$34,$C$26*$C$25,IF($C$25>=$C$33,$C$25*$C$26,\"check\")))))","v":258489.90273584906},{"$f":"IF($C$25<$C$33,$C$25*$C$26,IF($C$25>=$C$24,$C$24*$C$26,IF($C$25>=$C$35,$C$26*$C$24,IF($C$25>=$C$34,$C$26*$E$35,IF($C$25>=$C$33,$C$26*$E$34,\"check\")))))","v":258489.90273584906},{"$f":"IF($C$25<$C$33,$C$25*$C$26,IF($C$25>=$C$24,$C$24*$C$26,IF($C$25>=$C$35,$C$26*$C$24,IF($C$25>=$C$34,$C$26*$C$24,IF($C$25>=$C$33,$C$26*$E$35,\"check\")))))","v":258489.90273584906},{"$f":"IF($C$24=0, 0,IF($C$25<$C$33, $E$33*$C$26,IF($C$25>=$C$24,$C$24*$C$26,IF($C$25>=$C$35,$C$26*$C$24,IF($C$25>=$C$34,$C$26*$C$24,IF($C$25>=$C$33,$C$26*$C$24,\"check\"))))))","v":1357071.9893632072},{"$f":"IF($C$24=0, 0, IF($C$25<$C$33,$E$34*$C$26,IF($C$25>=$C$24,$C$24*$C$26,IF($C$25>=$C$35,$C$26*$C$24,IF($C$25>=$C$34,$C$26*$C$24,IF($C$25>=$C$33,$C$26*$C$24,\"check\"))))))","v":2261786.6489386791},{"$f":"IF($C$24=0, 0,IF($C$25<$C$33, $E$35*$C$26,IF($C$25>=$C$24,$C$24*$C$26,IF($C$25>=$C$35,$C$26*$C$24,IF($C$25>=$C$34,$C$26*$C$24,IF($C$25>=$C$33,$C$26*$C$24,\"check\"))))))","v":3166501.3085141503},{"$f":"IF($C$25<$C$33,$C$24*$C$26,IF($C$25>=$C$24,$C$24*$C$26,IF($C$25>=$C$35,$C$26*$C$24,IF($C$25>=$C$34,$C$26*$C$24,IF($C$25>=$C$33,$C$26*$C$24,\"check\")))))","v":3618858.6383018866},{"$f":"IF($C$25<$C$33,$C$24*$C$26,IF($C$25>=$C$24,0,IF($C$25>=$C$35,$C$26*$C$24,IF($C$25>=$C$34,$C$26*$C$24,IF($C$25>=$C$33,$C$26*$C$24,\"check\")))))","v":3618858.6383018866},{"$f":"IF($C$25<$C$33,$C$24*$C$26,IF($C$25>=$C$24,0,IF($C$25>=$C$35,0,IF($C$25>=$C$34,$C$26*$C$24,IF($C$25>=$C$33,$C$26*$C$24,\"check\")))))","v":3618858.6383018866},{"$f":"IF($C$25<$C$33,$C$24*$C$26,IF($C$25>=$C$24,0,IF($C$25>=$C$35,0,IF($C$25>=$C$34,0,IF($C$25>=$C$33,$C$26*$C$24,\"check\")))))","v":3618858.6383018866},{"$f":"IF($C$25<$C$33,$C$24*$C$26,IF($C$25>=$C$24,0,IF($C$25>=$C$35,0,IF($C$25>=$C$34,0,IF($C$25>=$C$33,0,\"check\")))))","v":3618858.6383018866},{"$f":"IF($C$25<$C$33,$C$24*$C$26,IF($C$25>=$C$24,0,IF($C$25>=$C$35,0,IF($C$25>=$C$34,0,IF($C$25>=$C$33,0,\"check\")))))","v":3618858.6383018866},{"$f":"IF($C$25<$C$33,$C$24*$C$26,IF($C$25>=$C$24,0,IF($C$25>=$C$35,0,IF($C$25>=$C$34,0,IF($C$25>=$C$33,0,\"check\")))))","v":3618858.6383018866}]
[null,{"$f":"CONCATENATE(\"Vaccinators required if\",\" \", 'Epi-demographic'!C27, \" \", \"dogs vaccinated per vaccinator daily\")","v":"Vaccinators required if 100 dogs vaccinated per vaccinator daily"},{"$f":"C9/('Epi-demographic'!$C$28*'Epi-demographic'!$C$27)","v":123.09042987421384},{"$f":"D9/('Epi-demographic'!$C$28*'Epi-demographic'!$C$27)","v":123.09042987421384},{"$f":"E9/('Epi-demographic'!$C$28*'Epi-demographic'!$C$27)","v":123.09042987421384},{"$f":"F9/('Epi-demographic'!$C$28*'Epi-demographic'!$C$27)","v":646.2247568396225},{"$f":"G9/('Epi-demographic'!$C$28*'Epi-demographic'!$C$27)","v":1077.041261399371},{"$f":"H9/('Epi-demographic'!$C$28*'Epi-demographic'!$C$27)","v":1507.8577659591192},{"$f":"I9/('Epi-demographic'!$C$28*'Epi-demographic'!$C$27)","v":1723.2660182389936},{"$f":"J9/('Epi-demographic'!$C$28*'Epi-demographic'!$C$27)","v":1723.2660182389936},{"$f":"K9/('Epi-demographic'!$C$28*'Epi-demographic'!$C$27)","v":1723.2660182389936},{"$f":"L9/('Epi-demographic'!$C$28*'Epi-demographic'!$C$27)","v":1723.2660182389936},{"$f":"M9/('Epi-demographic'!$C$28*'Epi-demographic'!$C$27)","v":1723.2660182389936},{"$f":"N9/('Epi-demographic'!$C$28*'Epi-demographic'!$C$27)","v":1723.2660182389936},{"$f":"O9/('Epi-demographic'!$C$28*'Epi-demographic'!$C$27)","v":1723.2660182389936}]
[null,"Max capac. dog vaccinations",{"$f":"'Epi-demographic'!$C$26*'Epi-demographic'!$C$27*'Epi-demographic'!$C$28","v":9030000},{"$f":"'Epi-demographic'!$C$26*'Epi-demographic'!$C$27*'Epi-demographic'!$C$28","v":9030000},{"$f":"'Epi-demographic'!$C$26*'Epi-demographic'!$C$27*'Epi-demographic'!$C$28","v":9030000},{"$f":"'Epi-demographic'!$C$26*'Epi-demographic'!$C$27*'Epi-demographic'!$C$28","v":9030000},{"$f":"'Epi-demographic'!$C$26*'Epi-demographic'!$C$27*'Epi-demographic'!$C$28","v":9030000},{"$f":"'Epi-demographic'!$C$26*'Epi-demographic'!$C$27*'Epi-demographic'!$C$28","v":9030000},{"$f":"'Epi-demographic'!$C$26*'Epi-demographic'!$C$27*'Epi-demographic'!$C$28","v":9030000},{"$f":"'Epi-demographic'!$C$26*'Epi-demographic'!$C$27*'Epi-demographic'!$C$28","v":9030000},{"$f":"'Epi-demographic'!$C$26*'Epi-demographic'!$C$27*'Epi-demographic'!$C$28","v":9030000},{"$f":"'Epi-demographic'!$C$26*'Epi-demographic'!$C$27*'Epi-demographic'!$C$28","v":9030000},{"$f":"'Epi-demographic'!$C$26*'Epi-demographic'!$C$27*'Epi-demographic'!$C$28","v":9030000},{"$f":"'Epi-demographic'!$C$26*'Epi-demographic'!$C$27*'Epi-demographic'!$C$28","v":9030000},{"$f":"'Epi-demographic'!$C$26*'Epi-demographic'!$C$27*'Epi-demographic'!$C$28","v":9030000}]
[null,"Net dog vaccination capacity",{"$f":"C11-C9","v":8771510.0972641502},{"$f":"D11-D9","v":8771510.0972641502},8771510.0972641502,7672928.0106367925,6768213.3510613209,5863498.6914858501,5411141.3616981134,{"$f":"IF(J9=0,0,J11-J9)","v":5411141.3616981134},{"$f":"IF(K9=0,0,K11-K9)","v":5411141.3616981134},5411141.3616981134,5411141.3616981134,5411141.3616981134,5411141.3616981134]
[null,"Current spending on dog vaccination†",{"$f":"$C$25*C$7*'Epi-demographic'!$C$16","v":467349.74414641515},{"$f":"$C$25*D$7*'Epi-demographic'!$C$16","v":467349.74414641515},{"$f":"$C$25*E$7*'Epi-demographic'!$C$16","v":467349.74414641515},{"$f":"$C$25*F$7*'Epi-demographic'!$C$16","v":467349.74414641515},{"$f":"$C$25*G$7*'Epi-demographic'!$C$16","v":467349.74414641515},{"$f":"$C$25*H$7*'Epi-demographic'!$C$16","v":467349.74414641515},{"$f":"$C$25*I$7*'Epi-demographic'!$C$16","v":467349.74414641515},{"$f":"$C$25*J$7*'Epi-demographic'!$C$16","v":467349.74414641515},{"$f":"$C$25*K$7*'Epi-demographic'!$C$16","v":467349.74414641515},{"$f":"$C$25*L$7*'Epi-demographic'!$C$16","v":467349.74414641515},{"$f":"$C$25*M$7*'Epi-demographic'!$C$16","v":467349.74414641515},{"$f":"$C$25*N$7*'Epi-demographic'!$C$16","v":467349.74414641515},{"$f":"$C$25*O$7*'Epi-demographic'!$C$16","v":467349.74414641515}]
[null,"Cost to vaccinate dogs based on phases",{"$f":"C9*C7","v":467349.74414641509},467349.74414641509,467349.74414641509,2453586.1567686787,4089310.2612811318,5725034.3657935839,6542896.4180498114,6542896.4180498114,6542896.4180498114,6542896.4180498114,6542896.4180498114,6542896.4180498114,6542896.4180498114,{"$f":"SUM(C14:O14)","v":59470254.942631327}]
[null,"Additional cost from scaling*",{"$f":"IF($C$25<$C$33,$C$23*($C$24-$C$25)*$C$26*$C$7,IF($C$25>=$C$24,0,IF($C$25<$C$24,IF($C$25>=$C$35,$C$23*($C$24-$C$25)*$C$26*$C$7,IF($C$25>=$C$34,$C$23*($C$24-$C$25)*$C$26*$C$7, IF($C$25>=$C$33,$C$23*($C$24-$C$25)*$C$26*$C$7,\"check\"))))))","v":607554.66739033943},{"$f":"IF($C$25<$C$33,$C$23*($C$24-$C$25)*$C$26*D$7,IF($C$25>=$C$24,0,IF($C$25<$C$24,IF($C$25>=$C$35,0,IF($C$25>=$C$34,$C$23*($C$24-$E$35)*$C$26*D$7, IF($C$25>=$C$33,$C$23*($C$24-$E$34)*$C$26*D$7,\"check\"))))))","v":607554.66739033943},{"$f":"IF($C$25<$C$33,$C$23*($C$24-$C$25)*$C$26*E$7,IF($C$25>=$C$24,0,IF($C$25<$C$24,IF($C$25>=$C$35,0,IF($C$25>=$C$34,0, IF($C$25>=$C$33,$C$23*($C$24-$E$35)*$C$26*E$7,\"check\"))))))","v":607554.66739033943},{"$f":"IF($C$24=0,0,IF($C$25<$C$33,$C$23*($C$24-$E$33)*$C$26*F$7,IF($C$25>=$C$24,0,IF($C$25<$C$24,IF($C$25>=$C$35,0,IF($C$25>=$C$34,0, IF($C$25>=$C$33,0,\"check\")))))))","v":408931.02612811327},{"$f":"IF($C$24=0,0,IF($C$25<$C$33,$C$23*($C$24-$E$34)*$C$26*G$7,IF($C$25>=$C$24,0,IF($C$25<$C$24,IF($C$25>=$C$35,0,IF($C$25>=$C$34,0, IF($C$25>=$C$33,0,\"check\")))))))","v":245358.61567686792},{"$f":"IF(C24=0,0,IF($C$25<$C$33,$C$23*($C$24-$E$35)*$C$26*H$7,IF($C$25>=$C$24,0,IF($C$25<$C$24,IF($C$25>=$C$35,0,IF($C$25>=$C$34,0, IF($C$25>=$C$33,0,\"check\")))))))","v":81786.20522562266},{"$f":"IF($C$25<$C$33,0,IF($C$25>=$C$24,0,IF($C$25<$C$24,IF($C$25>=$C$35,0,IF($C$25>=$C$34,0, IF($C$25>=$C$33,0,\"check\"))))))","v":0},0,0,0,0,0,0,{"$f":"SUM(C15:O15)","v":2558739.849201622}]
{"$rows_left_out":46}